mapbox download not working

   358   1   0
User Avatar
Member
3 posts
Joined: Oct. 2019
Offline
hello,
i work with the sop-mapbox node. First time it worked.
But now it doesnt.
When i try to download - look up - selelect location - it crashes. I get an error message:
Thanks n best regards,
Markus


Image Not Found


error:
return self._call_chain(*args)
File “C:\PROGRA~1\SIDEEF~1\HOUDIN~1.416\python27\lib\urllib2.py”, line 407, in _call_chain
result = func(*args)
File “C:\PROGRA~1\SIDEEF~1\HOUDIN~1.416\python27\lib\urllib2.py”, line 556, in http_error_default
raise HTTPError(req.get_full_url(), code, msg, hdrs, fp)
urllib2.HTTPError: HTTP Error 404: Not Found
Traceback (most recent call last):
File “opdef:/gamedev:op/sop_mapbox?PythonModule”, line 195, in <lambda>
File “opdef:/gamedev:op/sop_mapbox?PythonModule”, line 65, in on_button
File “opdef:/gamedev:op/sop_mapbox?PythonModule”, line 146, in refresh
File “C:\PROGRA~1\SIDEEF~1\HOUDIN~1.416\python27\lib\urllib2.py”, line 154, in urlopen
return opener.open(url, data, timeout)
File “C:\PROGRA~1\SIDEEF~1\HOUDIN~1.416\python27\lib\urllib2.py”, line 435, in open
response = meth(req, response)
File “C:\PROGRA~1\SIDEEF~1\HOUDIN~1.416\python27\lib\urllib2.py”, line 548, in http_response
‘http’, request, response, code, msg, hdrs)
File “C:\PROGRA~1\SIDEEF~1\HOUDIN~1.416\python27\lib\urllib2.py”, line 473, in error
return self._call_chain(*args)
File “C:\PROGRA~1\SIDEEF~1\HOUDIN~1.416\python27\lib\urllib2.py”, line 407, in _call_chain
result = func(*args)
File “C:\PROGRA~1\SIDEEF~1\HOUDIN~1.416\python27\lib\urllib2.py”, line 556, in http_error_default
raise HTTPError(req.get_full_url(), code, msg, hdrs, fp)
urllib2.HTTPError: HTTP Error 404: Not Found
Traceback (most recent call last):
File “opdef:/gamedev:op/sop_mapbox?PythonModule”, line 195, in <lambda>
File “opdef:/gamedev:op/sop_mapbox?PythonModule”, line 65, in on_button
File “opdef:/gamedev:op/sop_mapbox?PythonModule”, line 146, in refresh
File “C:\PROGRA~1\SIDEEF~1\HOUDIN~1.416\python27\lib\urllib2.py”, line 154, in urlopen
return opener.open(url, data, timeout)
File “C:\PROGRA~1\SIDEEF~1\HOUDIN~1.416\python27\lib\urllib2.py”, line 435, in open
response = meth(req, response)
File “C:\PROGRA~1\SIDEEF~1\HOUDIN~1.416\python27\lib\urllib2.py”, line 548, in http_response
‘http’, request, response, code, msg, hdrs)
File “C:\PROGRA~1\SIDEEF~1\HOUDIN~1.416\python27\lib\urllib2.py”, line 473, in error
return self._call_chain(*args)
File “C:\PROGRA~1\SIDEEF~1\HOUDIN~1.416\python27\lib\urllib2.py”, line 407, in _call_chain
result = func(*args)
File “C:\PROGRA~1\SIDEEF~1\HOUDIN~1.416\python27\lib\urllib2.py”, line 556, in http_error_default
raise HTTPError(req.get_full_url(), code, msg, hdrs, fp)
urllib2.HTTPError: HTTP Error 404: Not Found
Traceback (most recent call last):
File “opdef:/gamedev:op/sop_mapbox?PythonModule”, line 40, in url_changed
File “opdef:/gamedev:op/sop_mapbox?PythonModule”, line 65, in on_button
File “opdef:/gamedev:op/sop_mapbox?PythonModule”, line 146, in refresh
File “C:\PROGRA~1\SIDEEF~1\HOUDIN~1.416\python27\lib\urllib2.py”, line 154, in urlopen
return opener.open(url, data, timeout)
File “C:\PROGRA~1\SIDEEF~1\HOUDIN~1.416\python27\lib\urllib2.py”, line 435, in open
response = meth(req, response)
File “C:\PROGRA~1\SIDEEF~1\HOUDIN~1.416\python27\lib\urllib2.py”, line 548, in http_response
‘http’, request, response, code, msg, hdrs)
File “C:\PROGRA~1\SIDEEF~1\HOUDIN~1.416\python27\lib\urllib2.py”, line 473, in error
return self._call_chain(*args)
File “C:\PROGRA~1\SIDEEF~1\HOUDIN~1.416\python27\lib\urllib2.py”, line 407, in _call_chain
result = func(*args)
File “C:\PROGRA~1\SIDEEF~1\HOUDIN~1.416\python27\lib\urllib2.py”, line 556, in http_error_default
raise HTTPError(req.get_full_url(), code, msg, hdrs, fp)
urllib2.HTTPError: HTTP Error 404: Not Found
Qt Error: could not load TileJSON at http://a.tiles.mapbox.com/v4/mapbox.satellite.json?access_token=pk.eyJ1IjoiaG91ZGluaW1heCIsImEiOiJja2RnN3k1ZHUyMzg0MnZ0OTlnajY2OWczIn0.dN1MZkYTrgut-ftX_oo41A%0A [a.tiles.mapbox.com]
Qt Error: could not load TileJSON at http://a.tiles.mapbox.com/v4/mapbox.satellite.json?access_token=pk.eyJ1IjoiaG91ZGluaW1heCIsImEiOiJja2RnN3k1ZHUyMzg0MnZ0OTlnajY2OWczIn0.dN1MZkYTrgut-ftX_oo41A%0A [a.tiles.mapbox.com]
Traceback (most recent call last):
File “opdef:/gamedev:op/sop_mapbox?PythonModule”, line 195, in <lambda>
File “opdef:/gamedev:op/sop_mapbox?PythonModule”, line 65, in on_button
File “opdef:/gamedev:op/sop_mapbox?PythonModule”, line 146, in refresh
File “C:\PROGRA~1\SIDEEF~1\HOUDIN~1.416\python27\lib\urllib2.py”, line 154, in urlopen
return opener.open(url, data, timeout)
File “C:\PROGRA~1\SIDEEF~1\HOUDIN~1.416\python27\lib\urllib2.py”, line 435, in open
response = meth(req, response)
File “C:\PROGRA~1\SIDEEF~1\HOUDIN~1.416\python27\lib\urllib2.py”, line 548, in http_response
‘http’, request, response, code, msg, hdrs)
File “C:\PROGRA~1\SIDEEF~1\HOUDIN~1.416\python27\lib\urllib2.py”, line 473, in error
return self._call_chain(*args)
File “C:\PROGRA~1\SIDEEF~1\HOUDIN~1.416\python27\lib\urllib2.py”, line 407, in _call_chain
result = func(*args)
File “C:\PROGRA~1\SIDEEF~1\HOUDIN~1.416\python27\lib\urllib2.py”, line 556, in http_error_default
raise HTTPError(req.get_full_url(), code, msg, hdrs, fp)
urllib2.HTTPError: HTTP Error 404: Not Found
Qt Error: could not load TileJSON at http://a.tiles.mapbox.com/v4/mapbox.satellite.json?access_token=pk.eyJ1IjoiaG91ZGluaW1heCIsImEiOiJja2RnN3k1ZHUyMzg0MnZ0OTlnajY2OWczIn0.dN1MZkYTrgut-ftX_oo41A%0A [a.tiles.mapbox.com]
Qt Error: Uncaught Error: An API access token is required to use Mapbox.js. See https://www.mapbox.com/mapbox.js/api/v3.1.1/api-access-tokens/ [www.mapbox.com]
Traceback (most recent call last):
File “opdef:/gamedev:op/sop_mapbox?PythonModule”, line 195, in <lambda>
File “opdef:/gamedev:op/sop_mapbox?PythonModule”, line 48, in on_button
ValueError: need more than 4 values to unpack
Traceback (most recent call last):
File “opdef:/gamedev:op/sop_mapbox?PythonModule”, line 195, in <lambda>
File “opdef:/gamedev:op/sop_mapbox?PythonModule”, line 65, in on_button
File “opdef:/gamedev:op/sop_mapbox?PythonModule”, line 146, in refresh
File “C:\PROGRA~1\SIDEEF~1\HOUDIN~1.416\python27\lib\urllib2.py”, line 154, in urlopen
return opener.open(url, data, timeout)
File “C:\PROGRA~1\SIDEEF~1\HOUDIN~1.416\python27\lib\urllib2.py”, line 435, in open
response = meth(req, response)
File “C:\PROGRA~1\SIDEEF~1\HOUDIN~1.416\python27\lib\urllib2.py”, line 548, in http_response
‘http’, request, response, code, msg, hdrs)
File “C:\PROGRA~1\SIDEEF~1\HOUDIN~1.416\python27\lib\urllib2.py”, line 473, in error
return self._call_chain(*args)
File “C:\PROGRA~1\SIDEEF~1\HOUDIN~1.416\python27\lib\urllib2.py”, line 407, in _call_chain
result = func(*args)
File “C:\PROGRA~1\SIDEEF~1\HOUDIN~1.416\python27\lib\urllib2.py”, line 556, in http_error_default
raise HTTPError(req.get_full_url(), code, msg, hdrs, fp)
urllib2.HTTPError: HTTP Error 404: Not Found
Traceback (most recent call last):
File “opdef:/gamedev:op/sop_mapbox?PythonModule”, line 40, in url_changed
File “opdef:/gamedev:op/sop_mapbox?PythonModule”, line 65, in on_button
File “opdef:/gamedev:op/sop_mapbox?PythonModule”, line 146, in refresh
File “C:\PROGRA~1\SIDEEF~1\HOUDIN~1.416\python27\lib\urllib2.py”, line 154, in urlopen
return opener.open(url, data, timeout)
File “C:\PROGRA~1\SIDEEF~1\HOUDIN~1.416\python27\lib\urllib2.py”, line 435, in open
response = meth(req, response)
File “C:\PROGRA~1\SIDEEF~1\HOUDIN~1.416\python27\lib\urllib2.py”, line 548, in http_response
‘http’, request, response, code, msg, hdrs)
File “C:\PROGRA~1\SIDEEF~1\HOUDIN~1.416\python27\lib\urllib2.py”, line 473, in error
return self._call_chain(*args)
File “C:\PROGRA~1\SIDEEF~1\HOUDIN~1.416\python27\lib\urllib2.py”, line 407, in _call_chain
result = func(*args)
File “C:\PROGRA~1\SIDEEF~1\HOUDIN~1.416\python27\lib\urllib2.py”, line 556, in http_error_default
raise HTTPError(req.get_full_url(), code, msg, hdrs, fp)
urllib2.HTTPError: HTTP Error 404: Not Found
Traceback (most recent call last):
File “opdef:/gamedev:op/sop_mapbox?PythonModule”, line 195, in <lambda>
File “opdef:/gamedev:op/sop_mapbox?PythonModule”, line 65, in on_button
File “opdef:/gamedev:op/sop_mapbox?PythonModule”, line 146, in refresh
File “C:\PROGRA~1\SIDEEF~1\HOUDIN~1.416\python27\lib\urllib2.py”, line 154, in urlopen
return opener.open(url, data, timeout)
File “C:\PROGRA~1\SIDEEF~1\HOUDIN~1.416\python27\lib\urllib2.py”, line 435, in open
response = meth(req, response)
File “C:\PROGRA~1\SIDEEF~1\HOUDIN~1.416\python27\lib\urllib2.py”, line 548, in http_response
‘http’, request, response, code, msg, hdrs)
File “C:\PROGRA~1\SIDEEF~1\HOUDIN~1.416\python27\lib\urllib2.py”, line 473, in error
return self._call_chain(*args)
File “C:\PROGRA~1\SIDEEF~1\HOUDIN~1.416\python27\lib\urllib2.py”, line 407, in _call_chain
result = func(*args)
File “C:\PROGRA~1\SIDEEF~1\HOUDIN~1.416\python27\lib\urllib2.py”, line 556, in http_error_default
raise HTTPError(req.get_full_url(), code, msg, hdrs, fp)
urllib2.HTTPError: HTTP Error 404: Not Found
warning: failed to load ‘SOP_attribfrommap.svg’
‘C:/Users/Markus/Documents/houdini18.0/config/Icons/SVGIcons.cache’ corrupted?
warning: failed to load ‘SOP_attribfrommap.svg’
‘C:/Users/Markus/Documents/houdini18.0/config/Icons/SVGIcons.cache’ corrupted?
Qt Error: Uncaught Error: An API access token is required to use Mapbox.js. See https://www.mapbox.com/mapbox.js/api/v3.1.1/api-access-tokens/ [www.mapbox.com]
Traceback (most recent call last):
File “opdef:/gamedev:op/sop_mapbox?PythonModule”, line 195, in <lambda>
File “opdef:/gamedev:op/sop_mapbox?PythonModule”, line 48, in on_button
ValueError: need more than 4 values to unpack
Qt Error: Uncaught Error: An API access token is required to use Mapbox.js. See https://www.mapbox.com/mapbox.js/api/v3.1.1/api-access-tokens/ [www.mapbox.com]
Qt Error: Uncaught Error: An API access token is required to use Mapbox.js. See https://www.mapbox.com/mapbox.js/api/v3.1.1/api-access-tokens/ [www.mapbox.com]
Qt Error: could not load TileJSON at http://a.tiles.mapbox.com/v4/mapbox.satellite.json?access_token=pk.eyJ1IjoiaG91ZGluaW1heCIsImEiOiJja2RnNWFzbGcwZXhmMnJxcGYwZHF0aHluIn0.lJfCoHpzdIOEmy-hljW5-w [a.tiles.mapbox.com]
Qt Error: could not load TileJSON at http://a.tiles.mapbox.com/v4/mapbox.satellite.json?access_token=pk.eyJ1IjoiaG91ZGluaW1heCIsImEiOiJja2RnNWFzbGcwZXhmMnJxcGYwZHF0aHluIn0.lJfCoHpzdIOEmy-hljW5-w [a.tiles.mapbox.com]
Traceback (most recent call last):
File “opdef:/gamedev:op/sop_mapbox?PythonModule”, line 195, in <lambda>
File “opdef:/gamedev:op/sop_mapbox?PythonModule”, line 65, in on_button
File “opdef:/gamedev:op/sop_mapbox?PythonModule”, line 146, in refresh
File “C:\PROGRA~1\SIDEEF~1\HOUDIN~1.416\python27\lib\urllib2.py”, line 154, in urlopen
return opener.open(url, data, timeout)
File “C:\PROGRA~1\SIDEEF~1\HOUDIN~1.416\python27\lib\urllib2.py”, line 435, in open
response = meth(req, response)
File “C:\PROGRA~1\SIDEEF~1\HOUDIN~1.416\python27\lib\urllib2.py”, line 548, in http_response
‘http’, request, response, code, msg, hdrs)
File “C:\PROGRA~1\SIDEEF~1\HOUDIN~1.416\python27\lib\urllib2.py”, line 473, in error
return self._call_chain(*args)
File “C:\PROGRA~1\SIDEEF~1\HOUDIN~1.416\python27\lib\urllib2.py”, line 407, in _call_chain
result = func(*args)
File “C:\PROGRA~1\SIDEEF~1\HOUDIN~1.416\python27\lib\urllib2.py”, line 556, in http_error_default
raise HTTPError(req.get_full_url(), code, msg, hdrs, fp)
urllib2.HTTPError: HTTP Error 404: Not Found
Traceback (most recent call last):
File “opdef:/gamedev:op/sop_mapbox?PythonModule”, line 195, in <lambda>
File “opdef:/gamedev:op/sop_mapbox?PythonModule”, line 65, in on_button
File “opdef:/gamedev:op/sop_mapbox?PythonModule”, line 146, in refresh
File “C:\PROGRA~1\SIDEEF~1\HOUDIN~1.416\python27\lib\urllib2.py”, line 154, in urlopen
return opener.open(url, data, timeout)
File “C:\PROGRA~1\SIDEEF~1\HOUDIN~1.416\python27\lib\urllib2.py”, line 435, in open
response = meth(req, response)
File “C:\PROGRA~1\SIDEEF~1\HOUDIN~1.416\python27\lib\urllib2.py”, line 548, in http_response
‘http’, request, response, code, msg, hdrs)
File “C:\PROGRA~1\SIDEEF~1\HOUDIN~1.416\python27\lib\urllib2.py”, line 473, in error
return self._call_chain(*args)
File “C:\PROGRA~1\SIDEEF~1\HOUDIN~1.416\python27\lib\urllib2.py”, line 407, in _call_chain
result = func(*args)
File “C:\PROGRA~1\SIDEEF~1\HOUDIN~1.416\python27\lib\urllib2.py”, line 556, in http_error_default
raise HTTPError(req.get_full_url(), code, msg, hdrs, fp)
urllib2.HTTPError: HTTP Error 404: Not Found

Attachments:
salzburg.hipnc (516.7 KB)

User Avatar
Member
5 posts
Joined: Sept. 2015
Offline
Same error - Houdini is the latest and SideFXLabs updated - any ideas why?
  • Quick Links